[OSM-dev] Tirex compilation bug

Valery N. cat_crash at tut.by
Wed Mar 21 12:31:18 GMT 2012


Hi,
I just try to compile Tirex from sources and face next error:


*user at optiplex:~/mapnik2/tirex$ make*
*cd backend-mapnik; make*
*make[1]: Entering directory `/home/user/mapnik2/tirex/backend-mapnik'*
*g++ -g -O2 -Wall -Wextra -D_LARGEFILE_SOURCE -D_FILE_OFFSET_BITS=64 -I
/usr/include/freetype2/ -DBOOST_FILESYSTEM_VERSION=2    -c -o renderd.o
renderd.cc*
*renderd.cc: In member function ‘bool RenderDaemon::loadMapnikWrapper(const
char*)’:*
*renderd.cc:123: error: expected type-specifier*
*renderd.cc:123: error: expected unqualified-id before ‘cfgerr’*
*renderd.cc:123: error: expected ‘)’ before ‘cfgerr’*
*renderd.cc:123: error: expected ‘{’ before ‘cfgerr’*
*renderd.cc:123: error: ‘cfgerr’ was not declared in this scope*
*renderd.cc:123: error: expected ‘;’ before ‘)’ token*
*make[1]: *** [renderd.o] Error 1*
*make[1]: Leaving directory `/home/user/mapnik2/tirex/backend-mapnik'*
*make: *** [build] Error 2*


Installed under Ubuntu 10.04 LTS, Mapnik 2 (from sources)
-------------- next part --------------
An HTML attachment was scrubbed...
URL: <http://lists.openstreetmap.org/pipermail/dev/attachments/20120321/71fa6843/attachment.html>


More information about the dev mailing list