[Merkaartor] compile problem with current svn

Chris Browet cbro at semperpax.com
Wed Nov 12 10:51:09 GMT 2008


I think this due to the fact that you didn't re-run qmake.

There have been changes recently requiring it.

- Chris -

2008/11/12 <arnd.baecker at web.de>

> Hi,
>
> when trying to compile current svn I get the error below.
> Is there anything obvious which I am missing?
> Does someone else also have this problem?
> Compiling from svn used to work for about three weeks ago ...
>
> BTW: thanks a lot for this great application!!!
>
> Best, Arnd
>
> In file included from PropertiesDock.cpp:18:
> TagTemplate/TagTemplate.h:44: warning: unused parameter F
> TagTemplate/TagTemplate.h:49: warning: unused parameter xParent
> TagTemplate/TagTemplate.h:49: warning: unused parameter header
> PropertiesDock.cpp: In member function void
> PropertiesDock::adjustSelection():
> PropertiesDock.cpp:216: warning: comparison between signed and unsigned
> integer expressions
> PropertiesDock.cpp: In member function void
> PropertiesDock::switchToTrackPointUi(MapFeature*):
> PropertiesDock.cpp:333: error: class Ui::TrackPointProperties has no
> member named variableLayout
> PropertiesDock.cpp: In member function void
> PropertiesDock::switchToRoadUi(MapFeature*):
> PropertiesDock.cpp:351: error: class Ui::RoadProperties has no member
> named variableLayout
> PropertiesDock.cpp: In member function void
> PropertiesDock::switchToRelationUi(MapFeature*):
> PropertiesDock.cpp:367: error: class Ui::RelationProperties has no member
> named variableLayout
> PropertiesDock.cpp: In member function void PropertiesDock::resetValues():
> PropertiesDock.cpp:410: error: class Ui::TrackPointProperties has no
> member named variableLayout
> PropertiesDock.cpp:413: error: class Ui::TrackPointProperties has no
> member named variableLayout
> PropertiesDock.cpp:428: error: class Ui::RoadProperties has no member
> named variableLayout
> PropertiesDock.cpp:431: error: class Ui::RoadProperties has no member
> named variableLayout
> PropertiesDock.cpp:442: error: class Ui::RelationProperties has no member
> named variableLayout
> PropertiesDock.cpp: At global scope:
> PropertiesDock.cpp:722: warning: unused parameter aNewTemplate
> make: *** [tmp/obj_debug/PropertiesDock.o] Error 1
>
>
> _______________________________________________
> Merkaartor mailing list
> Merkaartor at openstreetmap.org
> http://lists.openstreetmap.org/listinfo/merkaartor
>
-------------- next part --------------
An HTML attachment was scrubbed...
URL: <http://lists.openstreetmap.org/pipermail/merkaartor/attachments/20081112/41d2a65d/attachment.html>


More information about the Merkaartor mailing list