[Merkaartor] X Error: RenderBadGlyphSet ?

Robert Joop 6765407352758mkt at rainbow.in-berlin.de
Sat Apr 25 13:30:51 BST 2009


On 09-04-25 12:40:31 CEST, Chris Browet wrote:
> Hi All,
> 
> Could you try the 0.13 svn version at "
> http://svn.openstreetmap.org/applications/editors/merkaartor-branches/merkaartor-0.13-fixes"
> to see if it solves the problem?
> 
> Be sure to take a fresh checkout or "make distclean" first.

i did a fresh checkout,
looked the first line from my 0.14-svn Makefile to see how to configure it, and
tried to compile it:

% /usr/bin/qmake-qt4 -unix GEOIMAGE=1 GPSD=1 NODEBUG=0 PREFIX=/tmp/mt0.13 TRANSDIR_MERKAARTOR=/tmp/mt0.13/translations -o Makefile Merkaartor.pro
% make
[...]
g++ -c -pipe -g -Wall -W -D_REENTRANT -DVERSION="\"0.13\"" -DREVISION="\".2\"" -DUSEGPSD -D_TTY_POSIX_ -DTRANSDIR_MERKAARTOR="\"/tmp/mt0.13/translations\"" -DYAHOO -DBROWSERIMAGEMANAGER_IS_THREADED -DGEOIMAGE -DQT_WEBKIT_LIB -DQT_SVG_LIB -DQT_XML_LIB -DQT_GUI_LIB -DQT_NETWORK_LIB -DQT_CORE_LIB -DQT_SHARED -I/usr/share/qt4/mkspecs/linux-g++ -I. -I/usr/include/qt4/QtCore -I/usr/include/qt4/QtNetwork -I/usr/include/qt4/QtGui -I/usr/include/qt4/QtXml -I/usr/include/qt4/QtSvg -I/usr/include/qt4/QtWebKit -I/usr/include/qt4 -I. -IRender -Iqextserialport -IGPS -INameFinder -ITools -ITagTemplate -IQtStyles -IQtStyles/skulpture22 -Itmp -Itmp -o tmp/obj_debug/browserimagemanagerthreaded.o QMapControl/browserimagemanagerthreaded.cpp
QMapControl/browserimagemanagerthreaded.cpp: In constructor ‘BrowserImageManager::BrowserImageManager(QObject*)’:
QMapControl/browserimagemanagerthreaded.cpp:96: error: type ‘QThread’ is not a direct base of ‘BrowserImageManager’
QMapControl/browserimagemanagerthreaded.cpp:96: error: class ‘BrowserImageManager’ does not have any field named ‘requestActive’
QMapControl/browserimagemanagerthreaded.cpp: In member function ‘void BrowserImageManager::launchRequest()’:
QMapControl/browserimagemanagerthreaded.cpp:161: error: ‘requestActive’ was not declared in this scope
QMapControl/browserimagemanagerthreaded.cpp: In member function ‘void BrowserImageManager::pageLoadFinished(bool)’:
QMapControl/browserimagemanagerthreaded.cpp:169: error: ‘requestActive’ was not declared in this scope
QMapControl/browserimagemanagerthreaded.cpp: At global scope:
QMapControl/browserimagemanagerthreaded.cpp:263: error: no ‘void BrowserImageManager::run()’ member function declared in class ‘BrowserImageManager’
QMapControl/browserimagemanagerthreaded.cpp:279: error: no ‘void BrowserImageManager::checkRequests()’ member function declared in class ‘BrowserImageManager’
make: *** [tmp/obj_debug/browserimagemanagerthreaded.o] Error 1

rj




More information about the Merkaartor mailing list